Sambucus nigra
type: Concept
created: 2014-10-27T15:09:50Z
modified: 2025-05-16T17:40:42Z
in dataset: Agrovoc
alternative label: soc comun
alternative label: soc negru
alternative label: Schwarzer Holunder @de
alternative label: ááááá£áá @ka
alternative label: aÄaç mürver @tr
alternative label: kara mürver @tr
broader: c_14065
definition: xDef i7b5a99fe-b56e-4c2c-b218-00f0c860a274
in scheme: agrovoc