pertes et préjudices
type: Concept
created: 2025-06-06T16:12:34
modified: 2025-10-06T13:41:51
in dataset: Agrovoc
alternative label: pertes et dommages
broader: c 13fb5a08
definition: xDef 904cc31a
definition: xDef 5ecdb0f3
definition: xDef 897f760a
definition: xDef ce7f639c
definition: xDef d66d8e9d
definition: xDef 412b3c80
in scheme: agrovoc
preferred label: loss and damage @en
preferred label: æå¤±åç ´å @zh
preferred label: Ø§ÙØ®Ø³Ø§Ø¦Ø± ÙØ§ÙØ£Ø¶Ø±Ø§Ø± @ar
preferred label: Pérdidas y daños @es
preferred label: Ð¿Ð¾ÑÐµÑÐ¸ Ð¸ ÑÑÐµÑÐ± @ru
preferred label: Perdite e danni @it
preferred label: tap og skade @nb
preferred label: tab og skade @da
preferred label: hasara na uharibifu @sw
related: c_1374567058134
scope note: This refers to loss and damage associated with climate change impacts. Usually used in singular form in English in UNFCC context. For the general phenomena of "losses" see <c_4438>. For the general phenomena of "damage" see <c_26768>. @en
scope note: Generalmente se usa en plural para el español en el contexto de la CMNUCC. @es
scope note: Il sâagit des pertes et dommages liés aux impacts du changement climatique. Terme utilisé au pluriel par la CCNUCC.