heterocysts
type: Concept
has object of activity: c 5196
make use of: c_16003
created: 2025-04-16T11:59:46
modified: 2025-10-06T12:57:17
in dataset: Agrovoc
alternative label: Heterocyste @de
alternative label: hétérokiste @fr
alternative label: heterocytes
broader: c 1418
definition: xDef 418f7452
definition: xDef 09fd447d
in scheme: agrovoc
preferred label: heterosisti @sw
preferred label: heterosist @tr
preferred label: Heterozyste @de
preferred label: Ð³ÐµÑÐµÑÐ¾ÑÐ¸ÑÑÐ¸ @uk
preferred label: heterocisto @pt
preferred label: Ð³ÐµÑÐµÑÐ¾ÑÐ¸ÑÑÑ @ru
preferred label: Heterocisto @es
preferred label: hétérocyste @fr
preferred label: Ø­ÙÙØµÙØ© Ù Ø®ØªÙØ·Ø© @ar
preferred label: å¼å½¢è @zh
preferred label: Heterocists @ca
preferred label: Eterocisti @it
preferred label: heterocyster @sv
preferred label: Heterocysty @pl
preferred label: heterocystar @nn
preferred label: heterocyter @da
scope note: A differentiated cell that functions as a site of nitrogen fixation under aerobic conditions.