health sciences
type: Concept
created: 2025-09-30T12:57:19
modified: 2025-10-10T08:36:34
in dataset: Agrovoc
broader: c_37989
definition: xDef_56120445
in scheme: agrovoc
preferred label: saÄlÄ±k bilimi @tr
preferred label: Nauki o zdrowiu @pl
preferred label: science de la santé @fr
preferred label: Ø¹ÙÙÙ ØµØ­ÙØ© @ar
preferred label: ä¿å¥ç§å­¦ @zh
preferred label: Ð½Ð°ÑÐºÐ¸ Ð¾ Ð·Ð´Ð¾ÑÐ¾Ð²ÑÐµ @ru
preferred label: Ciencia de la salud @es
preferred label: sundhedsvidenskab @da
preferred label: hälsovetenskap @sv
preferred label: Ciência da saúde @pt
preferred label: Scienze della salute @it
preferred label: egészségtudományok @hu
preferred label: Gesundheitswissenschaften @de
scope note: Inclui as ciências relacionadas Ã saúde humana, tais como: medicina, odontologia, enfermagem, farmácia, nutrição, saúde pública, fisioterapia, fonoaudiologia. @pt
scope note: Incluye las ciencias relacionadas a la salud humana, tales como: medicina, odontología, enfermería, farmacia, nutrición, salud pública, fisioterapia, fonoaudiología. @es
scope note: Included here are human health sciences, such as medicine, dentistry, nursing, pharmacy, nutrition, public health, physical therapy specialty, and speech, language and hearing sciences.