üre formaldehit
type: Concept
is used as: c 7110
is used as: c 7164
created: 2025-07-11T11:38:45
modified: 2025-10-27T05:02:01
in dataset: Agrovoc
alternative label: Ð¼Ð¾ÑÐµÐ²Ð¸Ð½Ð°-ÑÐ¾ÑÐ¼Ð°Ð»ÑÐ´ÐµÐ³Ð¸Ð´ @ru
alternative label: üre formaldehit gübresi
alternative label: urea formaldehyde fertilizers @en
broader: c_32041
definition: xDef 550b98e7
definition: xDef 832dbc4d
in scheme: agrovoc
preferred label: urea formaldehyde @en
preferred label: ÙÙØ±Ù Ø§ÙØ¯ÙÙØ¯ Ø§ÙÙÙØ±ÙØ§ @ar
preferred label: Urea formaldehído @es
preferred label: urée formaldéhyde @fr
preferred label: è²ç²é @zh
preferred label: ureumformaldehyde @nl
preferred label: formaldeído de uréia @pt
preferred label: ÐºÐ°ÑÐ±Ð°Ð¼Ð¸Ð´Ð¾ÑÐ¾ÑÐ¼Ð°Ð»ÑÐ´ÐµÐ³Ð¸Ð´ @ru
preferred label: à¸¢à¸¹à¹à¸£à¸µà¸¢à¸à¸­à¸£à¹à¸¡à¸±à¸¥à¸à¸µà¹à¸®à¸à¹ @th
scope note: TarÄ±mda üre formaldehit bileÅikleri en sÄ±k kullanÄ±lan yavaÅ salÄ±nÄ±mlÄ± gübre türlerinden biridir.
scope note: In agriculture, urea-formaldehyde compounds are one of the most commonly used types of slow-release fertilizer. @en