zero-acreage farming
type: Concept
created: 2025-03-12T10:55:52
modified: 2025-04-28T11:48:19
in dataset: Agrovoc
alternative label: bina entegre tarÄ±m @tr
alternative label: building-based agriculture
broader: c 2807
definition: xDef 6f046ed9
definition: xDef 0a35864b
definition: xDef a80b0656
in scheme: agrovoc
preferred label: Agricultura de superficie cero @es
preferred label: agriculture Ã superficie nulle @fr
preferred label: é¶å å°åä¸ @zh
preferred label: Ð±ÐµÐ·Ð·ÐµÐ¼ÐµÐ»ÑÐ½Ð¾Ðµ ÑÐµÐ»ÑÑÐºÐ¾Ðµ Ñ Ð¾Ð·ÑÐ¹ÑÑÐ²Ð¾ @ru
preferred label: Ø§ÙØ²Ø±Ø§Ø¹Ø© Ø§ÙÙØ§Ø¦Ù Ø© Ø¹ÙÙ Ø§ÙØ¨ÙØ§Ø¡ @ar
preferred label: Gebäudegebundene Landwirtschaft @de
preferred label: sÄ±fÄ±r alan tarÄ±mÄ± @tr
preferred label: kilimo cha ekari sifuri @sw
scope note: Specht et al. (2013) introduced the term âzero-acreage farmingâ (ZFarming) to describe all types of urban agriculture characterised by the non-use of farmland or open space, thereby differentiating building-related forms of urban agriculture from those in parks, gardens, or urban wastelands.