Persicaria perfoliata
type: Concept
created: 2017-04-26T11:10:54Z
modified: 2025-05-16T17:40:42Z
in dataset: Agrovoc
alternative label: Persicaria perfoliatum @ka
alternative label: kapliçotu
alternative label: Polygonum perfoliatum
broader: c 46c8cdf7
definition: xDef 95badb05
definition: xDef f926b06d
in scheme: agrovoc
scope note: Polygonum perfoliatum was preferred term up to 2010. @en