Ginglymostoma brevicaudatum
type: Concept
created: 2011-11-20T21:14:52Z
modified: 2025-09-15T07:45:55
in dataset: Agrovoc
broader: c_38080
editorial note: Author: Günther, 1867
in scheme: agrovoc
scope note: Synonym of Pseudoginglymostoma brevicaudatum (Günther, 1867)