Raja kenojei
type: Concept
created: 2011-11-20T21:15:47Z
modified: 2025-09-16T13:54:58
in dataset: Agrovoc
broader: c_38513
editorial note: Author: Müller & Henle, 1841
in scheme: agrovoc
preferred label: æé³ @zh
scope note: Synonym of Okamejei kenojei (Müller & Henle, 1841)