nanorods
type: Concept
is used in: c d21f5376
created: 2025-08-13T07:12:32
modified: 2025-09-25T07:26:24
in dataset: Agrovoc
broader: c 74f4c8aa
definition: xDef 4fee05d8
definition: xDef 6ac0f990
definition: xDef 0c01948f
in scheme: agrovoc
preferred label: Nanobarra @es
preferred label: Nanobarre @it
preferred label: nanotige @fr
preferred label: nanostaafjes @nl
preferred label: Ð½Ð°Ð½Ð¾ÑÑÐµÑÐ¶Ð½Ð¸ @ru
preferred label: ÙØ§ÙÙÙ ÛÙÙ @fa
preferred label: Ð½Ð°Ð½Ð¾ÑÑÑÐ¸Ð¶Ð½Ñ @uk
preferred label: ÙØ¶Ø¨Ø§Ù ÙØ§ÙÙÙØ© @ar
preferred label: çº³ç±³æ£ @zh
preferred label: nanobastão @pt
preferred label: nanoçubuk @tr
scope note: Nanorods are multifunctional materials which can be used as sensors, catalysts, in display technologies, for energy harvesting and can be linked with microelectromechanical systems (MEMS).