Neorhizobium galegae
type: Concept
created: 2025-11-17T13:45:42
modified: 2025-11-17T14:11:11
in dataset: Agrovoc
alternative label: Rhizobium galegae
broader: c e2cad0ec
definition: xDef f8b2d2fa
editorial note: Author: (Lindström 1989) Mousavi et al. 2015
in scheme: agrovoc
scope note: Please note that while "Neorhizobium galegae" is validly published and accepted under the International Code of Nomenclature of Prokaryotes (ICNP), the basionym "Rhizobium galegae" is preferred by some sources