escapement
type: Concept
is affected by: c cee80734
created: 2025-05-28T08:02:04
modified: 2025-10-02T10:28:45
in dataset: Agrovoc
alternative label: kiwango cha utoroshaji @sw
alternative label: escapement rate
alternative label: taux d'échappement @fr
alternative label: éé¸ç @zh
broader: c_330493
definition: xDef_86353367
definition: xDef 510637d8
definition: xDef 95f3a6f2
definition: xDef de1edb83
in scheme: agrovoc
preferred label: échappement des poissons @fr
preferred label: éé¸é @zh
preferred label: Ø§ÙØ¥ÙÙØ§Øª @ar
preferred label: Ð´Ð¾Ð»Ñ Ð²Ð¾Ð·Ð²ÑÐ°ÑÐ° ÑÑÐ±Ñ @ru
preferred label: Fuoriuscita @it
preferred label: Fuga @es
preferred label: balÄ±k kaçÄ±ÅÄ± @tr
preferred label: utoroshaji @sw
related: c 8a97e204
related: c 6111
scope note: Escapement or escapement rate is a number or proportion of fish surviving (escaping from) a given fishery. For "escaped farmed fish", use <c_f9ced805>.