apotekarar
type: Concept
has object of activity: c 5760
is included in: c 5294
created: 2025-07-11T14:14:15
modified: 2025-10-27T04:49:57
in dataset: Agrovoc
alternative label: farmasøytar
alternative label: farmasøyter @nb
alternative label: ØµÙØ§Ø¯ÙØ© @ar
broader: c_50227
definition: xDef 431c5917
definition: xDef c96eed39
in scheme: agrovoc
preferred label: pharmacists @en
preferred label: Ø§ÙØµÙØ§Ø¯ÙØ© @ar
preferred label: è¯åå¸ @zh
preferred label: pharmacien @fr
preferred label: apotekere @nb
preferred label: apotekare @sv
preferred label: ÑÐ°ÑÐ¼Ð°ÑÐµÐ²ÑÑ @ru
preferred label: farmacêutico @pt
preferred label: Farmacéutico @es
preferred label: farmaceuter @da
preferred label: eczacÄ± @tr
preferred label: à¹à¸ à¸ªà¸±à¸à¸à¸£ @th
scope note: Healthcare professionals who practice in pharmacy. For scientists who specializes in the study of chemistry, see "chemists" <c_1523>. @en