nyavu zilizowekwa
type: Concept
created: 2025-04-14T13:09:06
modified: 2025-10-06T13:44:37
in dataset: Agrovoc
alternative label: nyavu zilizotiwa nanga
broader: c 2951
definition: xDef 16720d7c
in scheme: agrovoc
preferred label: å®ç½®ç½ @zh
preferred label: set nets @en
preferred label: Ø´Ø¨ÙØ© Ø«Ø§Ø¨ØªØ© @ar
preferred label: Red fija @es
preferred label: staande netten @nl
preferred label: sættegarn @da
preferred label: ÑÑÐ°Ð²Ð½ÑÐµ ÑÐµÑÐ¸ @ru
preferred label: filet fixe @fr
preferred label: sabit aÄ @tr
scope note: Set net fishing does not need bait and, apart from a few areas with strong tidal flow, is much more efficient than longlines for catching various species of bottom dwelling fish, sharks and associated species. @en