visual perception
type: Concept
affects: c 0559f8c7
affects: c_28627
affects: c_35175
created: 2025-11-14T12:50:50
modified: 2025-11-17T12:41:44
in dataset: Agrovoc
broader: c_27922
definition: xDef c0e64f4c
definition: xDef 1bee07d8
definition: xDef 2418d1a9
definition: xDef 31b6d96d
in scheme: agrovoc
preferred label: Percepción visual @es
preferred label: perception visuelle @fr
preferred label: percepção visual @pt
preferred label: synuppfattning @sv
preferred label: Ø¥Ø¯Ø±Ø§Ù Ø¨ØµØ±Ù @ar
preferred label: visuele waarneming @nl
preferred label: Ð²Ð¸Ð·ÑÐ°Ð»ÑÐ½Ð¾Ðµ Ð²Ð¾ÑÐ¿ÑÐ¸ÑÑÐ¸Ðµ @ru
preferred label: è§è§æç¥ @zh
preferred label: synsoppfattelse @nb
preferred label: synsoppfatning @nn
preferred label: görsel algÄ± @tr
preferred label: visuelle Wahrnehmung @de
scope note: Differentiate from ocular vision: visual perception takes place in the brain, ocular vision takes place in the eye.
scope note: Fiferencie de visão ocular; percepção visual ocorre no encéfalo, visão ocorre no olho. @pt
scope note: Diferencie de visión ocular; percepción visual ocurre en el encéfalo, visión ocurre en el ojo. @es