Ù ÙØ·ÙØ© Ø¥ÙÙÙÙÙØ¬ÙÙØ©
type: Concept
created: 2025-09-30T15:16:25
modified: 2025-09-30T15:50:56
in dataset: Agrovoc
alternative label: Ù ÙØ·ÙØ© Ø¨ÙØ¦ÙØ©
alternative label: à¤ªà¤¾à¤°à¤¿à¤¸à¥à¤¥à¤¿à¤¤à¤¿à¤ à¤®à¤£à¥à¤¡à¤²à¥à¤à¤°à¤£ @hi
broader: c_330988
definition: xDef faf2d376
in scheme: agrovoc
narrower: c 3e1607bb
preferred label: à°ªà°°à±à°¯à°¾à°µà°°à°£ à°®à°à°¡à°²à°¾à°²à± @te
preferred label: zone ecologice @ro
preferred label: áááááááá£á á áááá @ka
preferred label: çæåº @zh
preferred label: à¹à¸à¸à¸à¸²à¸à¸à¸´à¹à¸§à¸¨à¸§à¸´à¸à¸¢à¸² @th
preferred label: ekologické pásma @sk
preferred label: ekologická pásma @cs
preferred label: ecological zones @en
preferred label: Zona ecológica @es
preferred label: Ù ÙØ§Ø·Ù Ø¨ÙÙ âØ´ÙØ§Ø®ØªÙ @fa
preferred label: zone écologique @fr
preferred label: à¤ªà¤¾à¤°à¤¿à¤¸à¥à¤¥à¤¿à¤¤à¤¿à¤ à¤®à¤£à¥à¤¡à¤² @hi
preferred label: ökológiai zóna @hu
preferred label: Zone ecologiche @it
preferred label: çæ åº @ja
preferred label: ìíì§ë @ko
preferred label: Strefa ekologiczna @pl
preferred label: zona ecológica @pt
preferred label: ÑÐºÐ¾Ð»Ð¾Ð³Ð¸ÑÐµÑÐºÐ¸Ðµ Ð·Ð¾Ð½Ñ @ru
scope note: Area with broad, yet relatively homogeneous natural vegetation formations that are similar, but not necessarily identical, in physiognomy. @en