biogenic reefs
type: Concept
is included in: c 94663ce7
created: 2025-01-15T11:16:05
modified: 2025-02-05T13:20:43
in dataset: Agrovoc
broader: c_92343
definition: xDef 4e89fe6c
in scheme: agrovoc
preferred label: biyojenik resif @tr
preferred label: biogena rev @sv
preferred label: biogene rev @da
preferred label: récif biogénique @fr
preferred label: Arrecife biogénico @es
preferred label: Ø´Ø¹Ø§Ø¨ Ø­ÙÙÙØ© @ar
preferred label: Ð±Ð¸Ð¾Ð³ÐµÐ½Ð½ÑÐµ ÑÐ¸ÑÑ @ru
preferred label: çç©æå ç¤ @zh
preferred label: recife biogénico @pt
preferred label: biogeniske rev @nb
preferred label: biogene riffen @nl
preferred label: biogén zátonyok @hu
preferred label: miamba ya kibiolojia @sw
related: c 085bb3b7
scope note: The concepts bioherms and biogenic reefs both refer to structures built by organisms, but they differ in terms of formation, structure, and scale. For bioherms, see <c_085bb3b7>.