istiÅari görüÅ
type: Concept
is used in: c 444cdbee
created: 2025-07-15T14:51:00
modified: 2025-10-03T08:52:40
in dataset: Agrovoc
alternative label: tavsiye görüÅÃ¼
alternative label: Dictamen consultivo @es
broader: c 8631
definition: xDef 25dcd51b
in scheme: agrovoc
preferred label: advisory opinions @en
preferred label: avis consultatif @fr
preferred label: Opinión consultiva @es
preferred label: Ø±Ø£Ù Ø§Ø³ØªØ´Ø§Ø±Ù @ar
preferred label: å¨è¯¢æè§ @zh
preferred label: ÐºÐ¾Ð½ÑÑÐ»ÑÑÐ°ÑÐ¸Ð²Ð½ÑÐµ Ð·Ð°ÐºÐ»ÑÑÐµÐ½Ð¸Ñ @ru
preferred label: ê¶ê³ ì ìê²¬ @ko
preferred label: rådgivende udtalelser @da
preferred label: rådgivande yttranden @sv
preferred label: rådgivende uttalelser @nb
preferred label: Opinie doradcze @pl
preferred label: à¸à¸§à¸²à¸¡à¹à¸«à¹à¸à¸à¸µà¹à¸à¸£à¸¶à¸à¸©à¸² @th
scope note: The UN General Assembly and the Security Council may request advisory opinions on any legal question. Other organs and the specialized agencies may request advisory opinions on legal questions arising within the scope of their activities. @en