Ð·Ð°ÑÐ²Ð»ÐµÐ½Ð¸Ðµ Ð¾ Ð¿Ð¸ÑÐµÐ²Ð¾Ð¹ ÑÐµÐ½Ð½Ð¾ÑÑÐ¸
type: Concept
is included in: c c258a4f2
created: 2025-06-18T09:26:04
modified: 2025-10-06T13:30:53
in dataset: Agrovoc
alternative label: ÑÐ²ÐµÐ´ÐµÐ½Ð¸Ñ Ð¾ Ð¿Ð¸ÑÐµÐ²Ð¾Ð¹ ÑÐµÐ½Ð½Ð¾ÑÑÐ¸
broader: c 142
definition: xDef a009fc8a
definition: xDef 15c886c4
definition: xDef a8f90d76
definition: xDef e4f22b2b
in scheme: agrovoc
preferred label: madai ya lishe @sw
preferred label: menÈiuni nutriÈionale @ro
preferred label: beslenme beyanÄ± @tr
preferred label: toitumisalased väited @et
preferred label: tápanyag-összetételre vonatkozó állítások @hu
preferred label: nutrition claims @en
preferred label: Ù Ø±ØªØ³Ù Ø§ÙÙ ØºØ°ÙØ§Øª @ar
preferred label: Declaración de propiedades nutricionales @es
preferred label: allégation nutritionnelle @fr
preferred label: è¥å »å£°ç§° @zh
preferred label: ernæringsanprisninger @da
preferred label: näringspåståenden @sv
preferred label: ernæringspåstander @nb
preferred label: ernæringspåstandar @nn
preferred label: OÅwiadczenia Å¼ywieniowe @pl
preferred label: alegação nutricional @pt
preferred label: voedingsclaims @nl
scope note: Mientras que las declaraciones de propiedades saludables se centran en la relación entre los alimentos y la salud, las declaraciones nutricionales destacan la composición del alimento en sí. Las siguientes no constituyen declaraciones de propiedades nutricionales: (a) la mención de sustancias en la lista de ingredientes; (b) la mención de nutrientes como parte obligatoria del etiquetado nutricional; (c) la declaración cuantitativa o cualitativa de ciertos nutrientes o ingredientes en la etiqueta, si la legislación nacional lo requiere. @es
scope note: While health claims focus on the relationship between food and health, nutrition claims highlight the composition of the food itself. The following do not constitute nutrition claims: (a) the mention of substances in the list of ingredients; (b) the mention of nutrients as a mandatory part of nutrition labelling and; (c) quantitative or qualitative declaration of certain nutrients or ingredients on the label if required by national legislation. @en
scope note: Ne constituent pas des allégations nutritionnelles: (a) la mention de substances dans la liste des ingrédients; (b) la mention dâéléments nutritifs en tant quâéléments obligatoires de lâétiquetage nutritionnel; (c) la déclaration quantitative ou qualitative de certains éléments nutritifs ou ingrédients sur lâétiquette, conformément aux lois et règlements dâun pays. @fr