diving birds
type: Concept
created: 2025-04-18T08:43:15
modified: 2025-10-20T18:40:48
in dataset: Agrovoc
broader: c_34154004
definition: xDef 867d034b
definition: xDef 470fd71f
in scheme: agrovoc
preferred label: ndege wapiga mbizi @sw
preferred label: áá§ááááááá á¤á áááááá @ka
preferred label: dalÄ±cÄ± kuÅ @tr
preferred label: æ½æ°´é¸ @zh
preferred label: Ð½ÑÑÑÑÑÐ¸Ðµ Ð¿ÑÐ¸ÑÑ @ru
preferred label: Ù¾Ø±ÙØ¯Ú¯Ø§Ù Ø´ÛØ±Ø¬ÙâØ²Ù @fa
preferred label: dykande fåglar @sv
preferred label: dykkende fugle @da
preferred label: dykkende fugler @nb
preferred label: dykkande fuglar @nn
preferred label: ï»ï»´ï»®ïº­ ïºï»ï»ï»®ïº¹ @ar
preferred label: oiseau plongeur @fr
preferred label: Ave buceadora @es
preferred label: pássaro mergulhador @pt
preferred label: Ptaki nurkujÄ ce @pl
preferred label: duikvogels @nl
scope note: For a person diving, use "divers" <c_c9686b58>.