Reserva de emergencia
type: Concept
is included in: c 0f039108
created: 2025-09-10T08:30:15
modified: 2025-11-03T16:02:56
in dataset: Agrovoc
alternative label: Existencia de emergencia
alternative label: acil stok @tr
alternative label: stock d'urgence @fr
broader: c_28772
definition: xDef 6486cabd
definition: xDef 19e80c63
definition: xDef e0fa2f2b
definition: xDef 26bc49f5
definition: xDef 8cd99a2a
in scheme: agrovoc
preferred label: emergency stocks @en
preferred label: ÑÑÑÐ°ÑÐµÐ³Ð¸ÑÐµÑÐºÐ¸Ðµ ÑÐµÐ·ÐµÑÐ²Ñ @ru
preferred label: åºæ¥å¨å¤ @zh
preferred label: Ù Ø®Ø²ÙÙØ§Øª ÙØ­Ø§ÙØ§Øª Ø§ÙØ·ÙØ§Ø±Ø¦ @ar
preferred label: stocks de sécurité @fr
preferred label: stocuri de urgenÈÄ @ro
preferred label: acil durum stoku @tr
preferred label: à¸à¸­à¸à¸à¸¸à¸à¸à¸¸à¸à¹à¸à¸´à¸ @th
scope note: Emergency stocks reduce consumer vulnerability during supply disruptions or price shocks in emergencies, whereas buffer stocks stabilize domestic market prices to avoid excessive volatility, benefiting both consumers and producers. @en