currants
type: Concept
is produced by: c 6585
created: 2025-09-11T13:22:14
modified: 2025-10-17T10:22:16
in dataset: Agrovoc
broader: c 7151
definition: xDef d969532f
in scheme: agrovoc
narrower: c 8379
narrower: c 6479
narrower: c 945
preferred label: Grosella @es
preferred label: ÑÐ¼Ð¾ÑÐ¾Ð´Ð¸Ð½Ð° @ru
preferred label: groseille @fr
preferred label: Ø§ÙÙØ´Ù Ø´ @ar
preferred label: å ä»å­ @zh
preferred label: rips @nb
preferred label: à¹à¸à¸­à¸£à¹à¹à¸£à¸à¸à¹ @th
preferred label: Frenk üzümü @tr
scope note: For Corinthian raisins (dried currants) use <c_78c7bbe0>.