جمهوری دموکراتیک کنگو
type: Concept
has code ISO3 country: COD
is included in: c f89fbff4
is member of: c_331313
is member of: c_35295
is member of: c 3084
is part of subvocabulary: Geographical country level
m49 code: 180
spatially includes: c_29714
spatially includes: c_29751
spatially includes: c_29709
spatially includes: c_29704
spatially includes: c_29724
spatially includes: c_29701
created: 2011-11-20T20:38:42Z
modified: 2024-01-15T14:01:52
in dataset: Agrovoc
alternative label: Kasai (Zaïre) @fr
alternative label: バンズンダ @ja
alternative label: 加丹加省 @zh
alternative label: Kongó (Kinshasa) @hu
alternative label: Kivu @sk
alternative label: エカトゥール @ja
alternative label: Kasai (Zaire) @tr
alternative label: काँन्गो (किंशासा) @hi
alternative label: Kasai @cs
alternative label: Congo (República Democrática) @pt
alternative label: บานดันดู @th
alternative label: ईक्वेटर (जायरे) @hi
alternative label: Kivu (Zair) @pl
alternative label: काँन्गो ओरियन्टेल @hi
alternative label: ザイール @ja
alternative label: كاتانگا
alternative label: 金沙萨 @zh
alternative label: Shaba (Zair) @pl
alternative label: Congo-Kinshasa @ro
preferred label: Zair @cs
alternative label: カタンガ @ja
alternative label: किंशासा @hi
alternative label: Congo (Leopoldville) @pt
alternative label: 자이르 @ko
alternative label: کنگو اوریانتاله
alternative label: Katanga @tr
alternative label: კონგო (დემოკრატიული რესპუბლიკა) @ka
alternative label: конго (леопольдвиль) @ru
alternative label: كاساي (زائير) @ar
alternative label: 沙巴区 @zh
alternative label: шаба (заир) @ru
alternative label: シャーバ @ja
alternative label: कटांगा @hi
alternative label: زائير @ar
alternative label: Belgické Kongo @cs
alternative label: კონგო (ლეოპოლდვილი) @ka
alternative label: कासई (जाएरे) @hi
alternative label: Zair Równikowy @pl
alternative label: شابا (زائير) @ar
alternative label: คองโก (สาธารณรัฐประชาธิปไตย) @th
alternative label: Bandundu @ro
alternative label: Equador (Zaire) @pt
preferred label: Konžská demokratická republika @sk
alternative label: كينشازا
alternative label: Kasai (zaire) @de
alternative label: Congo (République démocratique) @fr
alternative label: جمهوری دموکراتیک کونگو
alternative label: اكواتور (زئير)
alternative label: كنگو (كينشازا)
alternative label: كيوو (زئير)
alternative label: باندودا
alternative label: كاسائي (زئير)
alternative label: شابا (زئير)
alternative label: كنگو (لئوپولدويل)
alternative label: كنگو (جمهوري دموكراتيك)
alternative label: زئير
broader: c 1432
editorial note: Nom abrégé: République démocratique du Congo (la), nom complet: la République démocratique du Congo (FAONOCS, 2022) @fr
editorial note: Short name: Democratic Republic of the Congo (the), full name: the Democratic Republic of the Congo (FAONOCS, 2022) @en
editorial note: Nombre común: República Democrática del Congo (la), nombre completo: la República Democrática del Congo (FAONOCS, 2022) @es
editorial note: Amtliche Voll- und Kurzform: Demokratische Republik Kongo @de
in scheme: agrovoc
scope note: In the UN Standard country or area codes for statistical use (M49), Democratic Republic of the Congo is placed in Middle Africa. @en