quantum dots
type: Concept
is component of: c 8e15773e
is used in: c_9000123
created: 2025-08-12T14:06:31
modified: 2025-09-25T07:07:49
in dataset: Agrovoc
alternative label: yarÄ± iletken kuantum noktasÄ± @tr
alternative label: semiconductor quantum dots
broader: c 74f4c8aa
definition: xDef 523abc9d
definition: xDef 75af92c0
definition: xDef b90e9c55
definition: xDef 3b3a5d1e
in scheme: agrovoc
preferred label: boîte quantique @fr
preferred label: Punto cuántico @es
preferred label: Punti quantici @it
preferred label: kvanteprikker @nb
preferred label: ponto quântico @pt
preferred label: éå­ç¹ @zh
preferred label: ÙÙØ·Ø© ÙÙ ÙÙ ÙØ© @ar
preferred label: kwantumstippen @nl
preferred label: kvantprickar @sv
preferred label: ÐºÐ²Ð°Ð½ÑÐ¾Ð²Ð¸Ñ ÑÐ¾ÑÐ¾Ðº @uk
preferred label: ÐºÐ²Ð°Ð½ÑÐ¾Ð²ÑÐµ ÑÐ¾ÑÐºÐ¸ @ru
preferred label: kuantum noktasÄ± @tr
scope note: Due to their unique optical and electronic properties, quantum dots are used in biosensing, bioimaging, pathogen detection, food analysis, in greenhouse technology and more.