boulders
type: Concept
created: 2025-04-17T14:05:19
modified: 2025-10-06T13:51:55
in dataset: Agrovoc
alternative label: bowlders
alternative label: Bloque (geología) @es
alternative label: bloc (géologie) @fr
alternative label: Ð³Ð»ÑÐ±Ñ @ru
broader: c 6628
definition: xDef 436dac64
definition: xDef 76d4051a
definition: xDef fb1750e4
in scheme: agrovoc
preferred label: mawe mazito yaliyotoka mlimani @sw
preferred label: Ð²Ð°Ð»ÑÐ½Ñ @ru
preferred label: steinblokker @nn
preferred label: å·¨ç ¾ @zh
preferred label: Ø¬ÙÙ ÙØ¯ @ar
preferred label: Bloque de piedra @es
preferred label: bloc rocheux @fr
preferred label: stenblock @sv
preferred label: GÅazy @pl
preferred label: ë³¼ë @ko
preferred label: kaya bloku @tr
preferred label: ááá­áá á @ka
scope note: Geological concept, used extensively in defining aquatic benthic habitats.