Bubalus arnee
type: Concept
has taxonomic rank: c_331243
created: 2025-07-25T07:41:42
modified: 2025-08-08T08:15:08
in dataset: Agrovoc
alternative label: Bubalus bubalis subsp. arnee
alternative label: Bubalis vulgaris @cs
broader: c 0bcb631e
definition: xDef b428c18d
definition: xDef e4c702f0
in scheme: agrovoc
preferred label: æ²³æ°´ç @zh
preferred label: Ø¬Ø§Ù ÙØ³ Ø§ÙÙ Ø§Ø¡ Ø§ÙØ¨Ø±Ù @ar
preferred label: Ú¯Ø§ÙÙ ÛØ´ ÙØ­Ø´Û @fa
scope note: Note: authorities differ on rank and name. The International Commission on Zoological Nomenclature discussed naming of the wild and domestic water buffaloes and ruled in 2003 that the scientific name Bubalus arnee is valid for the wild form. However, GBIF uses Bubalus bubalis subsp. arnee and designates this as a subspecies, see https://www.gbif.org/species/7559792