boreholes
type: Concept
created: 2025-10-15T10:19:01
modified: 2025-11-07T14:05:50
in dataset: Agrovoc
broader: c 3714
definition: xDef 52d839b3
definition: xDef c4e4f35a
definition: xDef 2533426b
definition: xDef 87f8ff8f
in scheme: agrovoc
preferred label: trou de forage @fr
preferred label: Perforación @es
preferred label: Otwór wiertniczy @pl
preferred label: ÑÐºÐ²Ð°Ð¶Ð¸Ð½Ñ @ru
preferred label: Ø­ÙØ±Ø© Ù Ø«ÙÙØ¨Ø© @ar
preferred label: é»å­ @zh
preferred label: borehull @nb
preferred label: borehul @da
preferred label: à¸«à¸¥à¸¸à¸¡à¹à¸à¸²à¸° @th
preferred label: sondaj kuyusu @tr
related: c b5bb7eb8
scope note: A borehole is a deep, narrow hole drilled into the ground for various purposes, including water extraction, mineral exploration, or geotechnical investigation, while a tubewell is a type of well in which a long, narrow steel tube or PVC pipe is sunk into the ground to extract groundwater.