ÑÑÑÐ½Ð°Ñ Ð¸ÑÑÐ¾ÑÐ¸Ñ
type: Concept
make use of: c_37343
created: 2025-06-16T12:48:19
modified: 2025-11-25T11:47:31
in dataset: Agrovoc
alternative label: Ð½Ð°ÑÐºÐ° Ð¾ ÐºÐ»Ð¸Ð¼Ð°ÑÐµ
alternative label: Ð¸Ð·ÑÑÑÐ½Ð°Ñ Ð¸ÑÑÐ¾ÑÐ¸Ñ
alternative label: Ø§ÙØªØ§Ø±ÙØ® Ø§ÙÙ Ø±ÙÙ Ø´ÙÙÙØ§Ù @ar
broader: c 3635
definition: xDef 2b4231e5
definition: xDef 11249e48
definition: xDef da3b0018
in scheme: agrovoc
preferred label: ÑÑÐ¼ÐµÐ½Ð° Ð¸ÑÑÐ¾ÑÐ¸ÑÐ° @sr
preferred label: historia simulizi @sw
preferred label: ááááá á áá¡á¢áá áá @ka
preferred label: istorie oralÄ @ro
preferred label: oral history @en
preferred label: histoire orale @fr
preferred label: Historia oral @es
preferred label: ØªØ§Ø±ÙØ® Ø´ÙÙÙ @ar
preferred label: å£è¿°åå² @zh
preferred label: Storia orale @it
preferred label: história oral @pt
preferred label: mondelinge geschiedenis @nl
preferred label: mundtlig historie @da
preferred label: muntlig historie @nb
preferred label: sözlü tarih @tr
preferred label: Historia ustna @pl
scope note: Oral history is particularly useful for capturing stories from minority groups or small communities who will not often be represented in more formal histories. It is also useful when there is a lack of other sorts of evidence, whether written or visual. @en