geothermal heat flow
type: Concept
affects: c edb18e26
affects: c 2c378e9a
affects: c_31904
affects: c 3238
affects: c 7197
created: 2025-09-01T09:27:30
modified: 2025-10-27T06:46:58
in dataset: Agrovoc
broader: c 630f5d8a
definition: xDef 1cc72721
definition: xDef_56938888
definition: xDef 7b68fd9d
in scheme: agrovoc
preferred label: Flujo de calor geotérmico @es
preferred label: flux de chaleur géothermique @fr
preferred label: ÙØªØ¯ÙÙ Ø§ÙØ­Ø±Ø§Ø±Ø© Ø§ÙØ¬ÙÙÙØ© @ar
preferred label: Ð³ÐµÐ¾ÑÐµÑÐ¼Ð¸ÑÐµÑÐºÐ¸Ð¹ ÑÐµÐ¿Ð»Ð¾Ð²Ð¾Ð¹ Ð¿Ð¾ÑÐ¾Ðº @ru
preferred label: å°ç­ç­æµ @zh
preferred label: fluxo de calor geotérmico @pt
preferred label: jeotermal Ä±sÄ± akÄ±ÅÄ± @tr
preferred label: flux de cÄldurÄ geotermalÄ @ro
preferred label: à¸à¸²à¸£à¹à¸«à¸¥à¸à¸­à¸à¸à¸§à¸²à¸¡à¸£à¹à¸­à¸à¹à¸à¹à¸à¸´à¸ à¸ @th
scope note: For geoscience context, as in the transfer of heat from the centre of the Earth through the Earth's crust to the surface, use <c_a70b9d8b> "geothermal heat flow".