ulusal katkÄ± beyanÄ±
type: Concept
has object of activity: c 36198c2c
has object of activity: c_331597
has object of activity: c 1666
created: 2025-06-06T13:20:27
modified: 2025-10-06T13:03:39
in dataset: Agrovoc
alternative label: NDC
alternative label: iklim deÄiÅikliÄi ulusal katkÄ± beyanÄ±
alternative label: ÐÐÐ£Ð @ru
alternative label: CDN @es
alternative label: NDCs @en
broader: c_1374567058134
definition: xDef b1c17985
definition: xDef ae0f4b6a
definition: xDef 848b1e8e
definition: xDef 7de21330
definition: xDef 76c7d8c2
definition: xDef fe3a3e2a
in scheme: agrovoc
preferred label: nationally determined contributions @en
preferred label: contribution déterminée au niveau national @fr
preferred label: Contribución determinada a nivel nacional @es
preferred label: Ø§ÙÙ Ø³Ø§ÙÙ Ø§Øª Ø§ÙÙ Ø­Ø¯ÙØ¯Ø© ÙØ·ÙÙÙØ§ @ar
preferred label: Ð¾Ð¿ÑÐµÐ´ÐµÐ»ÑÐµÐ¼ÑÐµ Ð½Ð° Ð½Ð°ÑÐ¸Ð¾Ð½Ð°Ð»ÑÐ½Ð¾Ð¼ ÑÑÐ¾Ð²Ð½Ðµ Ð²ÐºÐ»Ð°Ð´Ñ @ru
preferred label: å½å®¶èªä¸»è´¡ç® @zh
preferred label: národnÄ stanovené pÅíspÄvky @cs
preferred label: michango iliyoamuliwa kitaifa @sw
scope note: Ø§ÙÙ Ø³Ø§ÙÙ Ø§Øª Ø§ÙÙ Ø­Ø¯Ø¯Ø© ÙØ·ÙÙØ§Ù (NDCs) ÙÙ Ø®Ø·Ø· Ø¹Ù Ù ÙØ·ÙÙØ© ÙÙ Ù Ø¬Ø§Ù Ø§ÙÙ ÙØ§Ø® ØªØ¶Ø¹ÙØ§ ÙÙ Ø¯ÙÙØ© Ø¨Ù ÙØ¬Ø¨ Ø§ØªÙØ§ÙÙØ© Ø¨Ø§Ø±ÙØ³. @ar
scope note: Las Contribuciones Determinadas a Nivel Nacional (NDC por sus siglas en inglés) son los planes nacionales de acción climática que presenta cada país en virtud del Acuerdo de París. @es
scope note: å½å®¶èªä¸»è´¡ç®ï¼æç§°NDCï¼æ¯æ¯ä¸ªå½å®¶æ ¹æ®ãå·´é»åå®ãå¶å®çå½å®¶æ°åè¡å¨è®¡åã @zh
scope note: ÐÐ¿ÑÐµÐ´ÐµÐ»ÑÐµÐ¼ÑÐµ Ð½Ð° Ð½Ð°ÑÐ¸Ð¾Ð½Ð°Ð»ÑÐ½Ð¾Ð¼ ÑÑÐ¾Ð²Ð½Ðµ Ð²ÐºÐ»Ð°Ð´Ñ Ð¸Ð»Ð¸ ÐÐÐ£Ð â ÑÑÐ¾ Ð½Ð°ÑÐ¸Ð¾Ð½Ð°Ð»ÑÐ½ÑÐµ Ð¿Ð»Ð°Ð½Ñ Ð´ÐµÐ¹ÑÑÐ²Ð¸Ð¹, ÑÐ²ÑÐ·Ð°Ð½Ð½ÑÑ Ñ Ð¸Ð·Ð¼ÐµÐ½ÐµÐ½Ð¸ÐµÐ¼ ÐºÐ»Ð¸Ð¼Ð°ÑÐ°, ÑÐ°Ð·ÑÐ°Ð±Ð¾ÑÐ°Ð½Ð½ÑÐµ ÐºÐ°Ð¶Ð´Ð¾Ð¹ ÑÑÑÐ°Ð½Ð¾Ð¹ Ð² ÑÐ°Ð¼ÐºÐ°Ñ ÐÐ°ÑÐ¸Ð¶ÑÐºÐ¾Ð³Ð¾ ÑÐ¾Ð³Ð»Ð°ÑÐµÐ½Ð¸Ñ. @ru
scope note: Les contributions déterminées au niveau national, ou CDN, sont des plans nationaux dâaction climatique élaborés par chaque pays dans le cadre de lâAccord de Paris. @fr
scope note: Nationally Determined Contributions, or NDCs, are national climate action plans by each country under the Paris Agreement. @en