Ð°Ð²ÑÐ¾Ð¼Ð°ÑÐ¸Ð·Ð¸ÑÐ¾Ð²Ð°Ð½Ð½Ð¾Ðµ Ð¿ÑÐ¾ÐµÐºÑÐ¸ÑÐ¾Ð²Ð°Ð½Ð¸Ðµ
type: Concept
includes: c 8ecca3e0
is included in: c_24009
is used in: c d4110e62
is used in: c d1fcf977
make use of: c_24008
created: 2025-07-09T10:56:41
modified: 2025-10-03T09:27:07
in dataset: Agrovoc
preferred label: CAD
alternative label: Diseño asistido por ordenador @es
alternative label: CAO @fr
alternative label: datastøtta design @nn
alternative label: datastøttet design @nb
alternative label: computer-assisted design @en
broader: c 2208
definition: xDef 7b548b44
definition: xDef 5f4e1caf
in scheme: agrovoc
preferred label: à¸à¸²à¸£à¸­à¸­à¸à¹à¸à¸à¸à¹à¸§à¸¢à¸à¸­à¸¡à¸à¸´à¸§à¹à¸à¸­à¸£à¹ @th
preferred label: bilgisayar destekli tasarÄ±m @tr
preferred label: computer-aided design @en
preferred label: tietokoneavusteinen suunnittelu @fi
preferred label: dihtorvehkiin plánen @se
preferred label: datorstödd design @sv
preferred label: Diseño asistido por computadora @es
preferred label: conception assistée par ordinateur @fr
preferred label: ØªØµÙ ÙÙ Ø¨Ù Ø³Ø§Ø¹Ø¯Ø© Ø§ÙØ­Ø§Ø³ÙØ¨ @ar
preferred label: è®¡ç®æºè¾ å©è®¾è®¡ @zh
preferred label: desenho assistido por computador @pt
preferred label: dataassistert konstruksjon @nb
preferred label: Projektowanie wspomagane komputerowo @pl
scope note: CAD ist die Abkürzung für englisch "computer-aided design", zu Deutsch rechnerunterstütztes Konstruieren. Auf Deutsch wird in der Regel diese Abkürzung verwendet. @de