nükleer DNA
type: Concept
created: 2025-07-14T11:05:46
modified: 2025-10-27T04:35:18
in dataset: Agrovoc
alternative label: nükleer genom
alternative label: nDNA
alternative label: Karyom @de
alternative label: Kerngenom @de
alternative label: génome nucléaire @fr
alternative label: Genoma nuclear @es
alternative label: nuclear genomes @en
broader: c 2347
definition: xDef 9f86cf10
definition: xDef fe7a95e8
in scheme: agrovoc
preferred label: nuclear DNA @en
preferred label: ADN nucléaire @fr
preferred label: DNA nucleare @it
preferred label: Ø­Ù Ø¶ ÙÙÙÙ ÙÙÙÙØ§Ø© @ar
preferred label: æ ¸DNA @zh
preferred label: ADN nuclear @pt
preferred label: nukleært DNA @nb
preferred label: kärn-DNA @sv
preferred label: ÑÐ´ÐµÑÐ½Ð°Ñ ÐÐÐ @ru
preferred label: Kern-DNA @de
preferred label: à¸à¸µà¹à¸­à¹à¸à¹à¸­à¹à¸à¸à¸´à¸§à¹à¸à¸¥à¸µà¸¢à¸ª @th
scope note: This is a criteria for determining genetic diversity and concerns germplasm pools and breeding programmes. Nuclear DNA or the nuclear genome is the DNA contained within each cell nucleus of a eukaryotic organism. It is different from the core genome, which represents the set of genes shared by all, or nearly all, strains of a given population or species of prokaryotes. @en