agricultural assets
type: Concept
created: 2025-11-21T08:26:24
modified: 2025-11-21T09:07:09
in dataset: Agrovoc
broader: c 677
definition: xDef e3d13fd5
definition: xDef c0623531
definition: xDef c6d83815
definition: xDef 33bb86c4
definition: xDef 3d0d6ee8
definition: xDef badb5d93
in scheme: agrovoc
preferred label: Ø£ØµÙÙ Ø²Ø±Ø§Ø¹ÙØ© @ar
preferred label: Activo agrícola @es
preferred label: actif agricole @fr
preferred label: ÑÐµÐ»ÑÑÐºÐ¾Ñ Ð¾Ð·ÑÐ¹ÑÑÐ²ÐµÐ½Ð½ÑÐµ Ð°ÐºÑÐ¸Ð²Ñ @ru
preferred label: åä¸èµäº§ @zh
scope note: ÙØªØ´Ù Ù Ø§ÙØ£ØµÙÙ Ø§ÙØ²Ø±Ø§Ø¹ÙØ© Ù Ø¬Ù ÙØ¹Ø© ÙØ§Ø³Ø¹Ø© Ù Ù Ø§ÙØ¹ÙØ§ØµØ±Ø Ø¨Ù Ø§ ÙÙÙØ§Ø Ø¹ÙÙ Ø³Ø¨ÙÙ Ø§ÙÙ Ø«Ø§Ù ÙØ§ Ø§ÙØ­ØµØ±Ø Ø§ÙØ¬Ø±Ø§Ø±Ø§ØªØ ÙØ§ÙØ­Ø§Ø²ÙÙ Ø§ØªØ ÙØ§ÙØ­ØµØ§Ø¯Ø§ØªØ ÙØ§ÙØ¯Ø±ÙÙØ§Ø³Ø§ØªØ ÙØ§ÙØ³Ù ÙØ§Ø¯Ø§ØªØ ÙØ§ÙÙ Ø­Ø§Ø±ÙØ«Ø ÙØ¢ÙØ§Øª Ø¬Ù Ø¹ Ø§ÙØ¬Ø°ÙØ± ÙØ§ÙØ¯Ø±ÙØ§ØªØ ÙØ§ÙÙ Ø¨Ø§Ø°Ø±Ø ÙØ¢ÙØ§Øª Ø¥Ø¯Ø§Ø±Ø© Ø§ÙØªØ±Ø¨Ø©Ø ÙÙ Ø±Ø§ÙÙ Ø§ÙØ±ÙØ ÙØ£Ø¯ÙØ§Øª Ø§ÙØ­Ø±Ø§Ø«Ø©Ø ÙØ§ÙØ¬Ø±Ø§Ø±Ø§Øª Ø§ÙÙ Ø¬ÙØ²Ø±Ø©Ø ÙØ¢ÙØ§Øª Ø§ÙØ­ÙØ¨Ø ÙØ¢ÙØ§Øª Ø§ÙØ£ÙØ¨Ø§ÙØ ÙØ§ÙÙ Ø¹Ø¯Ø§Øª Ø§ÙÙ ØªØ®ØµØµØ© Ø°Ø§Øª Ø§ÙØ¹Ø¬ÙØ§ØªØ ÙØ§ÙÙ ÙØ§Ø´ÙØ± Ø§ÙÙ Ø­Ù ÙÙØ©Ø ÙØ³ÙÙ Ø§ÙØµÙØ¯Ø ÙÙ Ø¹Ø¯Ø§Øª Ø§ÙØµÙØ¯Ø ÙÙÙØ¸Ù ØªØºØ°ÙØ© ØªØ±Ø¨ÙØ© Ø§ÙØ£Ø­ÙØ§Ø¡ Ø§ÙÙ Ø§Ø¦ÙØ©Ø ÙØ§ÙÙ Ø¶Ø®Ø§ØªØ ÙÙÙØ¸Ù Ø§ÙØªÙÙÙØ©Ø ÙØ³ÙÙ Ø§ÙØ®Ø¯Ù Ø© ÙØ¹Ù ÙÙØ§Øª ØªØ±Ø¨ÙØ© Ø§ÙØ£Ø­ÙØ§Ø¡ Ø§ÙÙ Ø§Ø¦ÙØ©. @ar
scope note: å ¶ä¸­å å«å¤ç§ç±»åï¼å æ¬ä½ä¸éäºï¼æææºãæææºãèåæ¶å²æºãè±ç²æºãæè¥æºãçãåæ ¹åèæ¶è·æºãæ­ç§æºãåå£¤èä½æºæ¢°ãçæºè®¾æ½ãèä½æºå ·ãå±¥å¸¦å¼æææºãæ¤å¥¶æºãä¹³ä¸æºæ¢°ãä¸ç¨è½®å¼è®¾å¤ãä¾¿æºå¼é¾é¯ãæ¸è¹ãæ¸å ·ãæ°´äº§å »æ®æææºãæ³µãå¢æ°§æºåæ°´äº§å »æ®è¾ å©è¹è¶ã @zh
scope note: Ð ÑÑÑ Ð³ÑÑÐ¿Ð¿Ñ Ð²Ñ Ð¾Ð´Ð¸Ñ ÑÐ¸ÑÐ¾ÐºÐ¸Ð¹ ÑÐ¿ÐµÐºÑÑ Ð¸Ð·Ð´ÐµÐ»Ð¸Ð¹, Ð² ÑÐ¾Ð¼ ÑÐ¸ÑÐ»Ðµ: ÑÑÐ°ÐºÑÐ¾ÑÑ, ÑÑÐºÐ¾Ð²ÑÐ¸ÐºÐ¸, ÐºÐ¾Ð¼Ð±Ð°Ð¹Ð½Ñ, Ð¼Ð¾Ð»Ð¾ÑÐ¸Ð»ÐºÐ¸, ÑÐ°ÑÐ¿ÑÐµÐ´ÐµÐ»Ð¸ÑÐµÐ»Ð¸ ÑÐ´Ð¾Ð±ÑÐµÐ½Ð¸Ð¹, Ð¿Ð»ÑÐ³Ð¸, Ð¼Ð°ÑÐ¸Ð½Ñ Ð´Ð»Ñ ÑÐ±Ð¾ÑÐºÐ¸ ÐºÐ¾ÑÐ½ÐµÐ¿Ð»Ð¾Ð´Ð¾Ð² Ð¸ ÐºÐ»ÑÐ±Ð½ÐµÐ¿Ð»Ð¾Ð´Ð¾Ð², ÑÐµÑÐ»ÐºÐ¸, Ð¿Ð¾ÑÐ²Ð¾Ð¿Ð¾Ð´Ð³Ð¾ÑÐ¾Ð²Ð¸ÑÐµÐ»ÑÐ½Ð°Ñ ÑÐµÑ Ð½Ð¸ÐºÐ°, Ð¾ÑÐ¾ÑÐ¸ÑÐµÐ»ÑÐ½ÑÐµ ÑÐ¸ÑÑÐµÐ¼Ñ, Ð¿Ð¾ÑÐ²Ð¾Ð¾Ð±ÑÐ°Ð±Ð°ÑÑÐ²Ð°ÑÑÐ¸Ðµ Ð¾ÑÑÐ´Ð¸Ñ, Ð³ÑÑÐµÐ½Ð¸ÑÐ½ÑÐµ ÑÑÐ°ÐºÑÐ¾ÑÑ, Ð´Ð¾Ð¸Ð»ÑÐ½ÑÐµ Ð°Ð³ÑÐµÐ³Ð°ÑÑ, Ð¾Ð±Ð¾ÑÑÐ´Ð¾Ð²Ð°Ð½Ð¸Ðµ Ð´Ð»Ñ Ð¸Ð·Ð³Ð¾ÑÐ¾Ð²Ð»ÐµÐ½Ð¸Ñ Ð¼Ð¾Ð»Ð¾ÑÐ½Ð¾Ð¹ Ð¿ÑÐ¾Ð´ÑÐºÑÐ¸Ð¸, ÑÐ¿ÐµÑÐ¸Ð°Ð»Ð¸Ð·Ð¸ÑÐ¾Ð²Ð°Ð½Ð½Ð¾Ðµ ÐºÐ¾Ð»ÐµÑÐ½Ð¾Ðµ Ð¾Ð±Ð¾ÑÑÐ´Ð¾Ð²Ð°Ð½Ð¸Ðµ, Ð¿Ð¾ÑÑÐ°ÑÐ¸Ð²Ð½ÑÐµ Ð±ÐµÐ½Ð·Ð¾Ð¿Ð¸Ð»Ñ, Ð¾ÑÑÐ´Ð¸Ñ Ð»Ð¾Ð²Ð°, ÐºÐ¾ÑÐ¼Ð¾ÑÐ°Ð·Ð´Ð°ÑÑÐ¸ÐºÐ¸ Ð´Ð»Ñ Ð°ÐºÐ²Ð°ÐºÑÐ»ÑÑÑÑÑ, Ð½Ð°ÑÐ¾ÑÑ, Ð°ÑÑÐ°ÑÐ¾ÑÑ Ð¸ ÑÑÐ´Ð° ÑÐ½Ð°Ð±Ð¶ÐµÐ½Ð¸Ñ Ð´Ð»Ñ Ð°ÐºÐ²Ð°ÐºÑÐ»ÑÑÑÑÑ. @ru
scope note: Ces actifs englobent un large éventail dâéléments, notamment les suivants: tracteurs, presses Ã balles, moissonneuses-batteuses, batteuses, épandeurs dâengrais, charrues, engins de récolte de racines ou de tubercules, semoirs, machines pour le travail du sol, ouvrages dâirrigation, instruments de labour, chenillards, trayeuses mécaniques, machines de production laitière, équipements spécialisés sur roues, tronçonneuses portatives, navires de pêche, engins de pêche, nourrisseurs, pompes, aérateurs et navires de ravitaillement pour lâaquaculture. @fr
scope note: Abarca una amplia variedad de productos, entre otros: tractores, empacadoras, cosechadoras, escardadoras, distribuidores de fertilizantes, arados, máquinas para la recolección de raíces o tubérculos, sembradoras, maquinaria de suelo, instalaciones de riego, herramientas de labranza, tractores de oruga, máquinas de ordeñar, máquinas para la industria láctea, equipos rodantes especializados, sierras de cadena portátiles, buques de pesca, artes de pesca, alimentadores acuícolas, bombas, aireadores y buques de suministro para la acuicultura. @es
scope note: It encompasses a wide array of items, including but not limited to: tractors, balers, combine harvesters, threshers, fertilizer distributors, ploughs, root or tuber harvesting machines, seeders, soil machinery, irrigation facilities, tillage implements, track-laying tractors, milking machines, dairy machines, specialized wheeled equipment, portable chainsaws, fishing vessels, fishing gear, aquaculture feeders, pumps, aerators and support vessels for aquaculture.