Sickerquelle
type: Concept
causes: c 4631
created: 2025-01-15T08:47:30
modified: 2025-02-01T19:53:46
in dataset: Agrovoc
alternative label: Helokrene
alternative label: Sumpfquelle
alternative label: helocrenes @en
alternative label: sumpkilder @da
broader: c 8326
definition: xDef 540457fa
definition: xDef 5e20edee
definition: xDef f3a6eb55
definition: xDef 173aef74
definition: xDef fdc902e6
in scheme: agrovoc
preferred label: helocrene springs @en
preferred label: Manantial helocreno @es
preferred label: source hélocrène @fr
preferred label: æ³æ°´ï¼æ²¼æ³½ç¼ @zh
preferred label: Ø¹ÙÙ Ù Ø³ØªÙÙØ¹ÙØ© @ar
preferred label: Ð³ÐµÐ»Ð¾ÐºÑÐµÐ½Ñ @ru
preferred label: helokrene kilder @nb
preferred label: nascente de água helocreno @pt
preferred label: helokrener @da
preferred label: chemchemi za helocrene @sw
scope note: Helocrene springs emerge diffusely in a marshy, wet meadow setting rather than having a discrete source. @en