action climatique
type: Concept
has object of activity: c_1374571087594
has object of activity: c_1374567058134
has object of activity: c_34841
created: 2025-06-06T15:31:31
modified: 2025-10-06T13:50:57
in dataset: Agrovoc
alternative label: action pour lutter contre le changement climatique
alternative label: Ð´ÐµÐ¹ÑÑÐ²Ð¸Ñ Ð² Ð¸Ð½ÑÐµÑÐµÑÐ°Ñ ÐºÐ»Ð¸Ð¼Ð°ÑÐ° @ru
alternative label: action pour le climat
broader: c_330834
definition: xDef ea417f46
definition: xDef d480f8be
definition: xDef 8d776f99
definition: xDef 4d35c7e1
in scheme: agrovoc
narrower: c d862c613
preferred label: climate action @en
preferred label: æ°åè¡å¨ @zh
preferred label: Acción por el clima @es
preferred label: Ð´ÐµÐ¹ÑÑÐ²Ð¸Ñ Ð¿Ð¾ Ð±Ð¾ÑÑÐ±Ðµ Ñ Ð¸Ð·Ð¼ÐµÐ½ÐµÐ½Ð¸ÐµÐ¼ ÐºÐ»Ð¸Ð¼Ð°ÑÐ° @ru
preferred label: Ø§ÙØ¥Ø¬Ø±Ø§Ø¡Ø§Øª Ø§ÙÙ ØªØ¹ÙÙØ© Ø¨Ø§ÙÙ ÙØ§Ø® @ar
preferred label: ação climática @pt
preferred label: klimaatactie @nl
preferred label: iklim eylemi @tr
preferred label: klimahandling @da
preferred label: hatua za kukabiliana na mabadiliko ya tabianchi @sw
scope note: ØªØ³ØªØ¹Ù Ù Ø¹Ø¨Ø§Ø±Ø© Ø§ÙØ¹Ù Ù Ø§ÙÙ ÙØ§Ø®Ù ÙÙ Ø§ÙØ³ÙØ§ÙØ§Øª Ø§ÙØ¹Ø§Ù Ø© Ø§ÙØªÙ ÙÙÙÙ Ø§ÙØ­Ø¯ÙØ« ÙÙÙØ§ Ø¹Ù ÙÙ Ø§ÙØ¬ÙÙØ¯ Ø§ÙÙ Ø¨Ø°ÙÙØ© Ù Ù Ø¬Ø§ÙØ¨ Ø§ÙØ­ÙÙÙ Ø§Øª ÙØ§ÙÙ Ø¬ØªÙ Ø¹ Ø§ÙÙ Ø¯ÙÙ ÙØ§ÙÙ ÙØ§Ø·ÙÙÙ ÙØ§ÙØ¥Ø¹ÙØ§Ù Ù Ù Ø£Ø¬Ù Ù ÙØ§ÙØ­Ø© ØªØºÙØ± Ø§ÙÙ ÙØ§Ø® ÙÙØ§Ø³Ø§ Ø¹ÙÙ Ø§ÙØ¹Ù Ù Ø§ÙØ³ÙØ§Ø³Ù Ù Ø«ÙØ§. Ø£Ù Ø§ Ø¹Ø¨Ø§Ø±Ø© Ø§ÙØ¥Ø¬Ø±Ø§Ø¡Ø§Øª Ø§ÙÙ ØªØ¹ÙÙØ© Ø¨Ø§ÙÙ ÙØ§Ø® ÙØªØ³ØªØ¹Ù Ù ÙÙ Ø§ÙØ³ÙØ§ÙØ§Øª Ø§ÙÙ Ø®ØµÙØµØ© Ø§ÙØªÙ ÙÙÙÙ Ø§ÙØ­Ø¯ÙØ« ÙÙÙØ§ Ø¹Ù ØªØ¯Ø§Ø¨ÙØ± ØªÙÙÙØ© ÙÙ ÙÙ ÙØ³Ø© Ø¨Ø¹ÙÙÙØ§ ØªØªØ®Ø° ÙÙØªØµØ¯Ù ÙØªØºÙÙØ± Ø§ÙÙ ÙØ§Ø® ÙØ¢Ø«Ø§Ø±Ù. @ar
scope note: Not to be confused with "Climate Action", which is the short form of SDG 13. @en