noix galip
type: Concept
is produced by: c 8e2d5af4
created: 2025-11-26T08:57:35
modified: 2025-11-26T09:38:48
in dataset: Agrovoc
alternative label: Almendra de Java @es
alternative label: noix de canari
alternative label: noix de nangaille
alternative label: canarium nuts @en
broader: c_12873
definition: xDef c27c7ed9
in scheme: agrovoc
preferred label: galip nuts @en
preferred label: ä¸å°åº¦æ©æ¦ @zh
preferred label: Ð¾ÑÐµÑ Ð¸ ÐºÐ°Ð½Ð°ÑÐ¸ÑÐ¼ @ru
preferred label: Nuez de galip @es
preferred label: ÙÙØ² Ø¬Ø§ÙØ© @ar
scope note: The common name in the Pacific is canarium nut. In Papua New Guinea, it is known as galip nut and also referred to as lawele (New Britain) and biuei (New Ireland). In Solomon Islands, it is commonly known as Ngali nut (Kwaraâae language), angari (Santa Ana), ngari (Kausage/Simbo and Varisi), ngoeta (Marovo), nolepo (Garciosa Bay), nyia nyinge (Ayiwo), and other names in other parts of Solomon Islands. In Vanuatu, it is known as nangai in local Bislama. Nanae (Santo Island), nige karia (Epi Island). @en