oleaginous fruits
type: Concept
includes: c_25470
includes: c_12926
is included in: c 5328
created: 2025-09-12T10:10:06
modified: 2025-10-24T08:50:12
in dataset: Agrovoc
broader: c 3131
definition: xDef 4b82f00b
in scheme: agrovoc
preferred label: fructe oleaginoase @ro
preferred label: yaÄlÄ± meyve @tr
preferred label: Ø«Ù Ø±Ø© Ø²ÙØªÙØ© @ar
preferred label: Fruto oleaginoso @es
preferred label: fruit oléagineux @fr
preferred label: å«æ²¹æ°´æ @zh
preferred label: Ð¼Ð°ÑÐ»Ð¾ÑÐ¾Ð´ÐµÑÐ¶Ð°ÑÐ¸Ðµ Ð¿Ð»Ð¾Ð´Ñ @ru
preferred label: olieholdige frugter @da
preferred label: fruto oleaginoso @pt
preferred label: oljeholdige frukter @nb
preferred label: oljehaltiga frukter @sv
preferred label: oliehoudende vruchten @nl
preferred label: ölhaltige Früchte @de
preferred label: à¸à¸¥à¹à¸¡à¹à¸à¹à¸³à¸¡à¸±à¸ @th
scope note: Oilseed crops and oleaginous fruits are groupings of crops of many different botanical types that produce the same type of product: oil.