ecological protection
type: Concept
has object of activity: c 2482
created: 2025-07-16T08:19:52
modified: 2025-10-03T09:30:02
in dataset: Agrovoc
broader: c_15898
definition: xDef fffd422e
in scheme: agrovoc
preferred label: Ø­Ù Ø§ÙØ© Ø§ÙÙØ¸Ø§Ù Ø§ÙØ¨ÙØ¦Ù @ar
preferred label: ÑÐºÐ¾Ð»Ð¾Ð³Ð¸ÑÐµÑÐºÐ°Ñ Ð·Ð°ÑÐ¸ÑÐ° @ru
preferred label: Ochrona ekologiczne @pl
preferred label: økologisk beskyttelse @da
preferred label: protection écologique @fr
preferred label: ekologiskt skydd @sv
preferred label: Protección ecológica @es
preferred label: çæä¿æ¤ @zh
preferred label: à¸à¸²à¸£à¸à¹à¸­à¸à¸à¸±à¸à¸£à¸°à¸à¸à¸à¸´à¹à¸§à¸¨ @th
scope note: While often used interchangeably, "ecological protection" and "environmental protection" have distinct focuses. Environmental protection generally refers to a broader approach encompassing the protection of the environment as a whole, including its physical and biological components, from harmful human activities. Ecological protection, on the other hand, is more specifically focused on the protection of ecological systems, including the interactions between living organisms and their environment.