nanosensors
type: Concept
make use of: c 3cf7e808
make use of: c 74f4c8aa
created: 2025-08-13T07:47:07
modified: 2025-09-25T07:24:34
in dataset: Agrovoc
broader: c_28279
definition: xDef 07a3e121
definition: xDef 0ed4402e
definition: xDef f2240785
in scheme: agrovoc
preferred label: Nanosensor @es
preferred label: nanossensor @pt
preferred label: Nanosensori @it
preferred label: Ù Ø³ØªØ´Ø¹Ø± ÙØ§ÙÙÙ @ar
preferred label: Ð½Ð°Ð½Ð¾ÑÐµÐ½ÑÐ¾ÑÐ¸ @uk
preferred label: Ð½Ð°Ð½Ð¾Ð´Ð°ÑÑÐ¸ÐºÐ¸ @ru
preferred label: çº³ç±³ä¼ æå¨ @zh
preferred label: nanosensör @tr
preferred label: nanocapteur @fr
scope note: Nanosensors can be used in intelligent food packaging to monitor and report the condition of the food; and in medicine, detection of contaminants and pathogens, and monitoring manufacturing processes and transportation systems.