urea formaldehyde resins
type: Concept
is component of: c 128
is component of: c 5600
is component of: c 2878
created: 2025-07-11T11:58:55
modified: 2025-10-27T05:02:25
in dataset: Agrovoc
broader: c 6519
definition: xDef 617eb549
definition: xDef fdbe1689
definition: xDef c710306d
in scheme: agrovoc
preferred label: résine urée-formaldéhyde @fr
preferred label: Resina de ureaformaldehído @es
preferred label: ÐºÐ°ÑÐ±Ð°Ð¼Ð¸Ð´Ð¾ÑÐ¾ÑÐ¼Ð°Ð»ÑÐ´ÐµÐ³Ð¸Ð´Ð½Ð°Ñ ÑÐ¼Ð¾Ð»Ð° @ru
preferred label: è²éæ è @zh
preferred label: Ø±Ø§ØªÙÙØ¬ Ø§ÙÙÙØ±ÙØ§ ÙØ§ÙÙÙØ±Ù Ø§ÙØ¯ÙÙØ§ÙØ¯ @ar
preferred label: resina de ureia formaldeído @pt
preferred label: Å»ywice mocznikowo-formaldehydowe @pl
preferred label: üre formaldehit reçinesi @tr
preferred label: Harnstoffharz @de
preferred label: à¹à¸£à¸à¸´à¸à¸¢à¸¹à¹à¸£à¸µà¸¢à¸à¸­à¸£à¹à¸¡à¸±à¸¥à¸à¸µà¹à¸®à¸à¹ @th
scope note: Urea formaldehyde resins are used in adhesives, plywood, particle board, medium-density fibreboard, and molded objects.