catch assessment
type: Concept
make use of: c fc69079d
make use of: c d311c431
created: 2025-07-15T07:13:35
modified: 2025-10-03T09:26:17
in dataset: Agrovoc
broader: c_330990
definition: xDef 4cfafa2c
in scheme: agrovoc
preferred label: Evaluación de capturas @es
preferred label: évaluation des captures @fr
preferred label: Ð¾ÑÐµÐ½ÐºÐ° ÑÐ»Ð¾Ð²Ð° @ru
preferred label: æ¸è·éè¯ä¼° @zh
preferred label: Stima delle catture @it
preferred label: ØªÙÙÙÙ Ø§ÙÙ ÙØµÙØ¯ @ar
preferred label: av deÄerlendirmesi @tr
preferred label: à¸à¸²à¸£à¸à¸£à¸°à¹à¸¡à¸´à¸à¸à¸¥à¸à¸²à¸£à¸à¸±à¸à¸ªà¸±à¸à¸§à¹à¸à¹à¸³ @th
scope note: Catch assessment can include catch assessment surveys, logbooks and landing reports, observer reports and more.