Neorhizobium
type: Concept
has taxonomic rank: c_11125
is included in: c_27939
created: 2025-11-17T13:30:15
modified: 2025-11-17T13:53:12
in dataset: Agrovoc
broader: c 6561
definition: xDef 3368ab42
editorial note: Author: Mousavi et al., 2015
in scheme: agrovoc
narrower: c 4a987b5d
scope note: Until 2018, Neorhizobium species were not associated with plant diseases, and their ecological roles were limited to beneficial plant-microbe interactions. However, even a typically symbiotic bacterium can acquire oncogenic capabilities and induce tumours on plants.