doÄal meydana gelme
type: Concept
created: 2024-12-18T10:39:32
modified: 2025-05-27T14:58:42Z
in dataset: Agrovoc
alternative label: doÄal olagelme
broader: c_330704
definition: xDef 8b5a80b0
definition: xDef 7729e218
in scheme: agrovoc
preferred label: ocorrência natural @pt-br
preferred label: kutokea kwa asili @sw
preferred label: Ø­Ø¯ÙØ« Ø·Ø¨ÙØ¹Ù @ar
preferred label: naturlig förekomst @sv
preferred label: occurrence naturelle @fr
preferred label: Ocurrencia natural @es
preferred label: naturleg forekomst @nn
preferred label: naturlig forekomst @nb
preferred label: pÅirozený výskyt @cs
preferred label: natürliches Vorkommen @de
preferred label: natural occurrence @en
preferred label: Ø±Ø®Ø¯Ø§Ø¯ Ø·Ø¨ÙØ¹Ù @fa
preferred label: természetes elõfordulás @hu
preferred label: èªç¶ç°å¢ã«ãããçºç @ja
preferred label: àºàº²àºà»àºàºµàºàºàº¶à»àºà»àºàºàºàº³àº¡àº°àºàº²àº @lo
preferred label: WystÄpowanie naturalne @pl
preferred label: ÐµÑÑÐµÑÑÐ²ÐµÐ½Ð½Ð°Ñ Ð²ÑÑÑÐµÑÐ°ÐµÐ¼Ð¾ÑÑÑ @ru
preferred label: prirodzený výskyt @sk
preferred label: èªç¶åç @zh
preferred label: Ð¿ÑÐ¸ÑÐ¾Ð´Ð½Ð° Ð·ÑÑÑÑÑÑÐ°Ð»ÑÐ½ÑÑÑÑ @uk
scope note: Natural occurrence should not be confused with "geographical distribution" or "normal distribution" <c_5083">. Natural occurrence can also be used for substances and phenomena. @en