green synthesis of nanomaterials
type: Concept
has product: c 93f051ee
has product: c 74f4c8aa
is included in: c_1307955710901
created: 2025-08-07T13:46:57
modified: 2025-09-25T07:06:17
in dataset: Agrovoc
broader: c fa591818
definition: xDef b70415d0
definition: xDef f9351240
definition: xDef d4f5f648
in scheme: agrovoc
preferred label: síntese verde de nanomateriais @pt
preferred label: Síntesis verde de nanomateriales @es
preferred label: synthèse verte de nanomatériaux @fr
preferred label: Ð·ÐµÐ»ÐµÐ½ÑÐ¹ ÑÐ¸Ð½ÑÐµÐ· Ð½Ð°Ð½Ð¾Ð¼Ð°ÑÐµÑÐ¸Ð°Ð»Ð¾Ð² @ru
preferred label: çº³ç±³ææçç»¿è²åæ @zh
preferred label: Ø§ÙØªØ®ÙÙÙ Ø§ÙØ£Ø®Ø¶Ø± ÙÙÙ ÙØ§Ø¯ Ø§ÙÙØ§ÙÙÙØ© @ar
preferred label: nanomalzemelerin yeÅil sentezi @tr
preferred label: grön syntes av nanomaterial @sv
preferred label: grøn syntese af nanomaterialer @da
preferred label: Zielona synteza nanomateriaÅów @pl
scope note: Green methods for nanomaterial synthesis apply natural biological systems to nanomaterial production.