ÑÐ¾ÑÐ½Ð°Ñ ÑÐµÑÐ¼ÐµÐ½ÑÐ°ÑÐ¸Ñ
type: Concept
make use of: c 4807
created: 2025-08-11T12:36:33
modified: 2025-09-25T07:39:46
in dataset: Agrovoc
alternative label: Ð¿ÑÐµÑÐ¸Ð·Ð¸Ð¾Ð½Ð½Ð°Ñ ÑÐµÑÐ¼ÐµÐ½ÑÐ°ÑÐ¸Ñ
broader: c 2855
definition: xDef 59ce776c
definition: xDef 1735085e
in scheme: agrovoc
preferred label: precision fermentation @en
preferred label: ç²¾ååé µ @zh
preferred label: fermentation de précision @fr
preferred label: Fermentación de precisión @es
preferred label: Ø§ÙØªØ®Ù Ø±Ù Ø§ÙØ¯ÙÙÙ @ar
preferred label: hassas fermantasyon @tr
preferred label: presisjonsfermentering @nb
preferred label: precisiefermentatie @nl
preferred label: præcisionsfermentering @da
scope note: âPrecision fermentationâ typically refers to the use of microbial hosts to produce, through fermentation, organic substrates into food items. While the term may be relatively new, many pointed out that technology itself has been around for decades. Despite this, as of May 2025, no country has established an official or legal definition of precision fermentation. @en