katÄ±lÄ±mcÄ± hareket
type: Concept
has object of activity: c_1374063074675
has object of activity: c_1374063462407
includes: c_37871
includes: c_37971
created: 2025-06-17T12:21:46
modified: 2025-10-20T18:55:30
in dataset: Agrovoc
alternative label: katÄ±lÄ±mcÄ± eylem
alternative label: åç»è¡å¨ @zh
broader: c_330834
definition: xDef 7ff8a02a
definition: xDef df19df4d
definition: xDef be31e6fe
definition: xDef 122450f7
definition: xDef b0596660
definition: xDef 560998a0
in scheme: agrovoc
preferred label: anticipatory action @en
preferred label: Ø¥Ø¬Ø±Ø§Ø¡ Ø§Ø³ØªØ¨Ø§ÙÙ @ar
preferred label: Acción anticipatoria @es
preferred label: action anticipatoire @fr
preferred label: ÑÐ¿ÑÐµÐ¶Ð´Ð°ÑÑÐµÐµ ÑÐµÐ°Ð³Ð¸ÑÐ¾Ð²Ð°Ð½Ð¸Ðµ @ru
preferred label: åç»åè¡å¨ @zh
preferred label: acção antecipatória @pt
preferred label: acÈiune anticipativÄ @ro
preferred label: varslingsbasert innsats @nb
preferred label: hatua za kujiandaa mapema @sw
scope note: Actions taken to reduce the humanitarian impacts of a forecast hazard before it occurs, or before its most acute impacts are felt. The decision to act is based on a forecast, or collective risk analysis, of when, where and how the event will unfold. @en