doÄal kayma açÄ±sÄ±
type: Concept
created: 2025-11-13T13:22:37
modified: 2025-11-14T11:44:21
in dataset: Agrovoc
alternative label: dinginlik açÄ±ÅÄ±
alternative label: duruÅ açÄ±sÄ±
alternative label: hellingshoek @nl
alternative label: Ãngulo de talud natural @es
alternative label: angle du talus d'éboulement @fr
alternative label: èªç¶å¾è§ @zh
broader: c 1521
definition: xDef d9908a1f
definition: xDef c9616902
definition: xDef 18f9013a
in scheme: agrovoc
preferred label: ÐºÑÑ Ð¿ÑÐ¸ÑÐ¾Ð´Ð½Ð¾Ð³Ð¾ ÑÐºÐ¾ÑÑ @uk
preferred label: rasvinkel @sv
preferred label: ÑÐ³Ð¾Ð» ÐµÑÑÐµÑÑÐ²ÐµÐ½Ð½Ð¾Ð³Ð¾ Ð¾ÑÐºÐ¾ÑÐ° @ru
preferred label: ângulo de repouso @pt
preferred label: angle of repose @en
preferred label: Ãngulo de reposo @es
preferred label: Ø²Ø§ÙÙØ© Ø§ÙØ³ÙÙÙ @ar
preferred label: ä¼æ­¢è§ @zh
preferred label: Angolo di resistenza al taglio @it
preferred label: friksjonsvinkel @nb
preferred label: stablingsvinkel @da
preferred label: luonnollinen kaatumiskulma @fi
preferred label: angle de talus naturel @fr
preferred label: felfekvési hajlásszög @hu
preferred label: hoek van inwendige wrijving @nl
preferred label: KÄ t tarcia wewnÄtrznego @pl
related: c_33494
scope note: The angle of repose is is used in materials science, engineering, and sometimes used in the design of equipment for the processing of particulate solids. For example, it may be used to design an appropriate hopper or silo to store the material, or to size a conveyor belt for transporting the material. @en