yerinden edilmiÅ kiÅi
type: Concept
created: 2025-04-18T07:23:08
modified: 2025-10-20T19:07:06
in dataset: Agrovoc
alternative label: yurtsuz kiÅi
broader: c e42455cf
definition: xDef 037e0846
definition: xDef 4dd40659
definition: xDef 1d9d5bab
definition: xDef 7153ae4f
in scheme: agrovoc
narrower: c dabac782
preferred label: watu waliokoseshwa makazi @sw
preferred label: displaced persons @en
preferred label: Ø§ÙÙ Ø´Ø±Ø¯ÙÙ @ar
preferred label: æµç¦»å¤±æäººå @zh
preferred label: personne déplacé @fr
preferred label: Persona desplazada @es
preferred label: Ð¿ÐµÑÐµÐ¼ÐµÑÐµÐ½Ð½ÑÐµ Ð»Ð¸ÑÐ° @ru
preferred label: fördrivna personer @sv
preferred label: fordrevne personer @nb
preferred label: ontheemde personen @nl
preferred label: persoane strÄmutate @ro
preferred label: fordrivne personar @nn
scope note: For persons forced to leave their home country, use "refugees". @en