macroalgal blooms
type: Concept
created: 2025-04-24T10:35:24
modified: 2025-10-06T13:54:17
in dataset: Agrovoc
broader: c 51dd9e80
definition: xDef 994afb56
definition: xDef 17a28a35
in scheme: agrovoc
narrower: c 9b842119
preferred label: ÑÐ²ÐµÑÐµÐ½Ð¸Ðµ Ð¼Ð°ÐºÑÐ¾Ð²Ð¾Ð´Ð¾ÑÐ¾ÑÐ»ÐµÐ¹ @ru
preferred label: makroalgeoppblomstringer @nb
preferred label: makroalgeopblomstringer @da
preferred label: prolifération de macroalgues @fr
preferred label: Floración de macroalgas @es
preferred label: Ø§Ø²Ø¯ÙØ§Ø± Ø§ÙØ·Ø­Ø§ÙØ¨ Ø§ÙÙØ¨ÙØ±Ø© @ar
preferred label: å¤§åè»å @zh
preferred label: proliferação de macroalgas @pt
preferred label: makroalg patlamasÄ± @tr
preferred label: ongezeko kubwa la mwani mkubwa @sw
related: c_14154
scope note: Macroalgal blooms can be blue-green, green, greenish brown or brown, depending on the species. For macroalgal blooms caused specifically by green macroalgae, see "green tides".