escaped farmed fish
type: Concept
created: 2025-03-21T11:07:29
modified: 2025-04-28T11:51:16
in dataset: Agrovoc
broader: c ece98a4d
definition: xDef 8b5604af
definition: xDef 74d3afae
in scheme: agrovoc
preferred label: Ø§Ø³Ù Ø§ÙÙ Ù Ø³ØªØ²Ø±Ø¹Ø© ÙØ§ÙØªØ© @ar
preferred label: Pez cultivado que se escapa @es
preferred label: poisson d'élevage échappé @fr
preferred label: ÑÑÐ±Ð°, ÑÑÐµÐ´ÑÐ°Ñ Ð² ÐµÑÑÐµÑÑÐ²ÐµÐ½Ð½ÑÐ¹ Ð²Ð¾Ð´Ð¾ÐµÐ¼ Ð¸Ð· Ð¼ÐµÑÑ ÑÐ°Ð·Ð²ÐµÐ´ÐµÐ½Ð¸Ñ @ru
preferred label: éé¸çå »æ®é±¼ç±» @zh
preferred label: rømt oppdrettsfisk @nb
preferred label: alÄ±k çiftliÄinden kaçan balÄ±klar @tr
preferred label: samaki wanaofugwa waliotoroka @sw
scope note: Escapes of fish from sea-cage aquaculture have typically been thought of as referring to juvenile and adult fish. Such escapes have been reported for almost all species presently cultured around the world. Recently, a second form of escape has come into focus, involving the escape of viable, fertilized eggs spawned by farmed individuals from sea-cage facilities, or so-called âescape through spawningâ.